Target
Adenosine receptor A3
Ligand
BDBM21220
Substrate
Ki
2333±n/a nM
Comments
PDSP_1302
Citation
 Klotz, KNVogt, HTawfik-Schlieper, H Comparison of A1 adenosine receptors in brain from different species by radioligand binding and photoaffinity labelling. Naunyn Schmiedebergs Arch Pharmacol 343:196-201 (1991)  
Target
Name:
Adenosine receptor A3
Synonyms:
AA3R_SHEEP ADENOSINE A1 high ADENOSINE A3 ADORA3
Type:
Enzyme Catalytic Domain
Mol. Mass.:
36152.74
Organism:
Sheep
Description:
ADENOSINE A1 ADORA1 Sheep::P35342
Residue:
317
  
Inhibitor
Name:
BDBM21220
Synonyms:
(2S,3S,4R,5R)-5-(6-amino-9H-purin-9-yl)-N-ethyl-3,4-dihydroxyoxolane-2-carboxamide Adenosine, N6-Ethyl-carboxamido CHEMBL464859 NECA
Type:
Antineoplastic Agent
Emp. Form.:
C12H16N6O4
Mol. Mass.:
308.2932
SMILES:
CCNC(=O)[C@H]1O[C@H]([C@H](O)[C@@H]1O)n1cnc2c(N)ncnc12
: