Target
Leucyl-cystinyl aminopeptidase
Ligand
BDBM271194
Substrate
Meas. Tech.
Inhibition of IRAP Assay
IC50
1.70±n/a nM
Citation
 Kawaguchi, KIshihata, AInagaki, YTsuchiya, KHanadate, TKanai, AKaizawa, HKazami, JMorikawa, HHiramoto, MEnjo, KTakamatsu, H Pyridine derivative US Patent  US10059720 Publication Date 8/28/2018 
Target
Name:
Leucyl-cystinyl aminopeptidase
Synonyms:
Cystinyl aminopeptidase Insulin-regulated membrane aminopeptidase Irap Leucyl-cystinyl aminopeptidase Otase P-LAP Vesicle protein of 165 kDa | Vp165
Type:
PROTEIN
Mol. Mass.:
117179.39
Organism:
Rattus norvegicus
Description:
ChEMBL_98523
Residue:
1025
  
Inhibitor
Name:
BDBM271194
Synonyms:
US10059720, Example 9 | US10975091, Example 9
Type:
Small organic molecule
Emp. Form.:
C20H30N2O4
Mol. Mass.:
362.4632
SMILES:
N[C@@H](CCC1CCC1)[C@](O)(Cc1cc(OCCC2CC2)ccn1)C(O)=O
: