Target
Leucyl-cystinyl aminopeptidase
Ligand
BDBM271258
Substrate
Meas. Tech.
Inhibition of IRAP Assay
IC50
1.10±n/a nM
Citation
 Kawaguchi, KIshihata, AInagaki, YTsuchiya, KHanadate, TKanai, AKaizawa, HKazami, JMorikawa, HHiramoto, MEnjo, KTakamatsu, H Pyridine derivative US Patent  US10059720 Publication Date 8/28/2018 
Target
Name:
Leucyl-cystinyl aminopeptidase
Synonyms:
Cystinyl aminopeptidase Insulin-regulated membrane aminopeptidase Irap Leucyl-cystinyl aminopeptidase Otase P-LAP Vesicle protein of 165 kDa | Vp165
Type:
PROTEIN
Mol. Mass.:
117179.39
Organism:
Rattus norvegicus
Description:
ChEMBL_98523
Residue:
1025
  
Inhibitor
Name:
BDBM271258
Synonyms:
US10059720, Example 73 | US10975091, Example 73
Type:
Small organic molecule
Emp. Form.:
C21H34N2O4
Mol. Mass.:
378.5057
SMILES:
CC(C)C[C@H](N)[C@](O)(Cc1cc(O[C@H]2CC[C@H](C)CC2)c(C)cn1)C(O)=O
: