Target
Norepinephrine transporter
Ligand
BDBM81946
Substrate
Ki
0.26±n/a nM
Comments
PDSP_1121
Citation
 Hyttel, JLarsen, JJ Neurochemical profile of Lu 19-005, a potent inhibitor of uptake of dopamine, noradrenaline, and serotonin. J Neurochem 44:1615-22 (1985)  
Target
Name:
Norepinephrine transporter
Synonyms:
Type:
Enzyme Catalytic Domain
Mol. Mass.:
2082.45
Organism:
RAT
Description:
Norepinephrine transporter 0 RAT::Q9JIA2
Residue:
19
MLLARMKPQVQPELGGADQ
  
Inhibitor
Name:
BDBM81946
Synonyms:
CAS_96850-13-4 LU 19-005
Type:
Small organic molecule
Emp. Form.:
C16H15Cl2N
Mol. Mass.:
292.203
SMILES:
CN[C@H]1C[C@@H](c2ccccc12)c1ccc(Cl)c(Cl)c1
: