Target
D(2) dopamine receptor
Ligand
BDBM50028421
Substrate
Ki
7.8±n/a nM
Comments
PDSP_1453
Citation
 Andersen, PH Comparison of the pharmacological characteristics of [3H]raclopride and [3H]SCH 23390 binding to dopamine receptors in vivo in mouse brain. Eur J Pharmacol 146:113-20 (1988)  
Target
Name:
D(2) dopamine receptor
Synonyms:
DOPAMINE D2 Dopamine D2 receptor Drd2
Type:
Enzyme
Mol. Mass.:
50957.64
Organism:
Mus musculus (Mouse)
Description:
P61168
Residue:
444
  
Inhibitor
Name:
BDBM50028421
Synonyms:
9-Methylsulfanylmethyl-7-propyl-4,6,6a,7,8,9,10,10a-octahydro-indolo[4,3-fg]quinoline; compound with methanesulfonic acid LY-127809 Pergolide | Permax
Type:
Small organic molecule
Emp. Form.:
C19H26N2S
Mol. Mass.:
314.488
SMILES:
CCCN1C[C@H](CSC)C[C@H]2[C@H]1Cc1c[nH]c3cccc2c13
: