Target
Adenosine receptor A1
Ligand
BDBM50014260
Substrate
Ki
>10000±n/a nM
Comments
PDSP_2809
Citation
 Schwabe, UUkena, DLohse, MJ Xanthine derivatives as antagonists at A1 and A2 adenosine receptors. Naunyn Schmiedebergs Arch Pharmacol 330:212-21 (1985)  
Target
Name:
Adenosine receptor A1
Synonyms:
AA1R_BOVIN ADENOSINE A1 high ADORA1 | Adenosine A1 receptor
Type:
Enzyme Catalytic Domain
Mol. Mass.:
36602.99
Organism:
BOVINE
Description:
ADENOSINE 0 BOVINE::P28190
Residue:
326
  
Inhibitor
Name:
BDBM50014260
Synonyms:
3,7-dihydro-3,7-dimethyl-1H-purine-2,6-dione 3,7-dimethylpurine-2,6-dione CHEMBL1114 theobromine
Type:
Small organic molecule
Emp. Form.:
C7H8N4O2
Mol. Mass.:
180.164
SMILES:
Cn1cnc2n(C)c(=O)[nH]c(=O)c12
: