Target
Adenosine receptor A1
Ligand
BDBM50001493
Substrate
Ki
>10000±n/a nM
Comments
PDSP_2542
Citation
 Bruns, RFLu, GHPugsley, TA Characterization of the A2 adenosine receptor labeled by [3H]NECA in rat striatal membranes. Mol Pharmacol 29:331-46 (1986) Target
Name:
Adenosine receptor A1
Synonyms:
AA1R_RAT ADENOSINE A1 high Adenosine A1 receptor (A1) Adenosine receptors A1 | Adora1
Type:
Protein
Mol. Mass.:
36704.13
Organism:
Rattus norvegicus (rat)
Description:
Residue:
326
  
Inhibitor
Name:
BDBM50001493
Synonyms:
3-Propyl-3,7-dihydro-purine-2,6-dione 3-Propylxanthine (enprofylline) ENPROFYLLINE
Type:
Small organic molecule
Emp. Form.:
C8H10N4O2
Mol. Mass.:
194.1906
SMILES:
CCCn1c2nc[nH]c2c(=O)[nH]c1=O
: