Target
Adenosine receptor A2a
Ligand
BDBM10850
Substrate
Ki
>10000±n/a nM
Comments
PDSP_2534
Citation
 Bruns, RFLu, GHPugsley, TA Characterization of the A2 adenosine receptor labeled by [3H]NECA in rat striatal membranes. Mol Pharmacol 29:331-46 (1986) Target
Name:
Adenosine receptor A2a
Synonyms:
A2A adenosine receptor (hA2A) ADENOSINE A2 ADORA2 Adenosine A2A receptor (A2AAR)
Type:
G Protein-Coupled Receptor (GPCR)
Mol. Mass.:
44716.46
Organism:
Homo sapiens (Human)
Description:
P29274
Residue:
412
  
Inhibitor
Name:
BDBM10850
Synonyms:
1-(5-Oxohexyl)theobromine (pentoxifylline) 3,7-dimethyl-1-(5-oxohexyl)-3,7-dihydropurine-2,6-dione Pentoxifylline Pentoxyphylline
Type:
Small organic molecule
Emp. Form.:
C13H18N4O3
Mol. Mass.:
278.307
SMILES:
CC(=O)CCCCn1c(=O)n(C)c2ncn(C)c2c1=O
: