Target
Voltage-dependent L-type calcium channel subunit alpha-1C
Ligand
BDBM50017698
Substrate
Ki
205±n/a nM
Comments
PDSP_2661
Citation
 Reynolds, IJSnowman, AMSnyder, SH (-)-[3H] desmethoxyverapamil labels multiple calcium channel modulator receptors in brain and skeletal muscle membranes: differentiation by temperature and dihydropyridines. J Pharmacol Exp Ther 237:731-8 (1986) Target
Name:
Voltage-dependent L-type calcium channel subunit alpha-1C
Synonyms:
CAC1C_RAT Cacn2 Cacnl1a1 Calcium channel (Type L) Calcium channel, L type, alpha-1 polypeptide, isoform 1, cardiac muscle RBC Voltage-dependent L-type calcium channel subunit alpha-1C Voltage-gated L-type calcium channel alpha-1C subunit | Voltage-gated calcium channel subunit alpha Cav1.2
Type:
Enzyme Catalytic Domain
Mol. Mass.:
243492.26
Organism:
RAT
Description:
Calcium channel 0 RAT::P22002
Residue:
2169
  
Inhibitor
Name:
BDBM50017698
Synonyms:
4-(4-(4-chlorophenyl)-4-hydroxypiperidin-1-yl)-N,N-dimethyl-2,2-diphenylbutanamide 4-[4-(4-Chloro-phenyl)-4-hydroxy-piperidin-1-yl]-N,N-dimethyl-2,2-diphenyl-butyramide(loperamide) Imodium LOPERAMIDE HYDROCHLORIDE med.21724, Compound 184
Type:
Small organic molecule
Emp. Form.:
C29H33ClN2O2
Mol. Mass.:
477.038
SMILES:
CN(C)C(=O)C(CCN1CCC(O)(CC1)c1ccc(Cl)cc1)(c1ccccc1)c1ccccc1
: