Target
Histamine H1 receptor
Ligand
BDBM50115644
Substrate
Ki
0.63±n/a nM
Comments
PDSP_3345
Citation
 de Boer, THMaura, GRaiteri, Mde Vos, CJWieringa, JPinder, RM Neurochemical and autonomic pharmacological profiles of the 6-aza-analogue of mianserin, Org 3770 and its enantiomers. Neuropharmacology 27:399-408 (1988)  
Target
Name:
Histamine H1 receptor
Synonyms:
HISTAMINE H1 Hrh1
Type:
Enzyme Catalytic Domain
Mol. Mass.:
55716.35
Organism:
RAT
Description:
HISTAMINE H1 HRH1 RAT::P31390
Residue:
486
  
Inhibitor
Name:
BDBM50115644
Synonyms:
(+/-)-12-Methyl-1,2,3,4,9,13b-hexahydro-2,4a,5-triaza-tribenzo[a,c,e]cycloheptene CHEMBL654 ORG 3770 | REMERON
Type:
Small organic molecule
Emp. Form.:
C17H19N3
Mol. Mass.:
265.3529
SMILES:
CN1CCN2C(C1)c1ccccc1Cc1cccnc21
: