Target
Tyrosine-protein kinase ABL1 [T315I]
Ligand
BDBM50294011
Substrate
Meas. Tech.
In Vitro Kinase Assay
IC50
478±0.0 nM
Citation
 Zhou, TCommodore, LHuang, WSWang, YSawyer, TKShakespeare, WCClackson, TZhu, XDalgarno, DC Structural analysis of DFG-in and DFG-out dual Src-Abl inhibitors sharing a common vinyl purine template. Chem Biol Drug Des 75:18-28 (2010)  
Target
Name:
Tyrosine-protein kinase ABL1 [T315I]
Synonyms:
ABL ABL1 Abelson murine leukemia viral oncogene homolog 1 Proto-oncogene c-Abl Tyrosine-protein kinase ABL (T315I) c-ABL p150
Type:
Mol. Mass.:
122909.35
Organism:
Homo sapiens (Human)
Description:
P00519 (T315I)
Residue:
1130
  
Inhibitor
Name:
BDBM50294011
Synonyms:
(E)-3-(2-(6-(Cyclopropylamino)-9H-purin-9-yl)vinyl)-4-methyl-N-(3-(4-methyl-1-imidazol-1-yl)-5-(trifluoromethyl)phenyl)benzamide 3-(2-(6-(cyclopropylamino)-9H-purin-9-yl)vinyl)-4-methyl-N-(3-(4-methyl-1H-imidazol-1-yl)-5-(trifluoromethyl)phenyl)benzamide AP-24163 CHEMBL539433
Type:
Small organic molecule
Emp. Form.:
C29H25F3N8O
Mol. Mass.:
558.557
SMILES:
Cc1cn(cn1)-c1cc(NC(=O)c2ccc(C)c(\C=C\n3cnc4c(NC5CC5)ncnc34)c2)cc(c1)C(F)(F)F
: