Target
Metabotropic glutamate receptor 4
Ligand
BDBM50053588
Substrate
Ki
>10000±n/a nM
Comments
PDSP_4809
Citation
 Thomsen, CBoel, ESuzdak, PD Actions of phenylglycine analogs at subtypes of the metabotropic glutamate receptor family. Eur J Pharmacol 267:77-84 (1994)  
Target
Name:
Metabotropic glutamate receptor 4
Synonyms:
GRM4_RAT Grm4 Metabotropic glutamate receptor 4 (mGlu4) mGlu4 metabotropic glutamate 4a
Type:
Enzyme
Mol. Mass.:
101849.79
Organism:
Rattus norvegicus (Rat)
Description:
P31423
Residue:
912
  
Inhibitor
Name:
BDBM50053588
Synonyms:
(S)-4-(amino(carboxy)methyl)benzoic acid 4-((S)-Amino-carboxy-methyl)-benzoic acid CHEMBL94990 | S-4-Carboxyphenylglycine
Type:
Small organic molecule
Emp. Form.:
C9H9NO4
Mol. Mass.:
195.1721
SMILES:
N[C@H](C(O)=O)c1ccc(cc1)C(O)=O
: