Target
Adenylate cyclase type 9
Ligand
BDBM50035398
Substrate
Ki
>10000±n/a nM
Comments
PDSP_222
Citation
 Arneric, SPSullivan, JPBriggs, CADonnelly-Roberts, DAnderson, DJRaszkiewicz, JLHughes, MLCadman, EDAdams, PGarvey, DS (S)-3-methyl-5-(1-methyl-2-pyrrolidinyl) isoxazole (ABT 418): a novel cholinergic ligand with cognition-enhancing and anxiolytic activities: I. In vitro characterization. J Pharmacol Exp Ther 270:310-8 (1994) Target
Name:
Adenylate cyclase type 9
Synonyms:
AC9 ADCY9 ATP pyrophosphate-lyase 9 Adenylyl cyclase 9 | KIAA0520
Type:
Enzyme Catalytic Domain
Mol. Mass.:
150716.21
Organism:
Homo sapiens (Human)
Description:
O60503
Residue:
1353
  
Inhibitor
Name:
BDBM50035398
Synonyms:
(S)-1-Methyl-2-(3-methyl-isoxazol-5-yl)-pyrrolidinium 3-Methyl-5-((S)-1-methyl-pyrrolidin-2-yl)-isoxazole CHEMBL274525
Type:
Small organic molecule
Emp. Form.:
C9H14N2O
Mol. Mass.:
166.2203
SMILES:
CN1CCC[C@H]1c1cc(C)no1
: