Target
Muscarinic acetylcholine receptor M1
Ligand
BDBM82372
Substrate
Ki
0.71±n/a nM
Comments
PDSP_983
Citation
 Lazareno, SBuckley, NJRoberts, FF Characterization of muscarinic M4 binding sites in rabbit lung, chicken heart, and NG108-15 cells. Mol Pharmacol 38:805-15 (1990) Target
Name:
Muscarinic acetylcholine receptor M1
Synonyms:
ACM1_RAT Chrm-1 cholinergic receptor, muscarinic 1
Type:
Enzyme Catalytic Domain
Mol. Mass.:
51390.46
Organism:
RAT
Description:
P08482
Residue:
460
  
Inhibitor
Name:
BDBM82372
Synonyms:
CAS_22254-24-6 NSC_3746
Type:
Small organic molecule
Emp. Form.:
C20H30NO3
Mol. Mass.:
332.4566
SMILES:
CC(C)[N+]1(C)C2CCC1CC(C2)OC(=O)C(CO)c1ccccc1
: