Target
Alpha-1A adrenergic receptor
Ligand
BDBM50026777
Substrate
Ki
>10000±n/a nM
Comments
PDSP_1222
Citation
 Schwinn, DAJohnston, GIPage, SOMosley, MJWilson, KHWorman, NPCampbell, SFidock, MDFurness, LMParry-Smith, DJ Cloning and pharmacological characterization of human alpha-1 adrenergic receptors: sequence corrections and direct comparison with other species homologues. J Pharmacol Exp Ther 272:134-42 (1995) Target
Name:
Alpha-1A adrenergic receptor
Synonyms:
ADA1A_RAT Adra1c Alpha-1A adrenoceptor Alpha-1C adrenergic receptor | adrenergic Alpha1A
Type:
Protein
Mol. Mass.:
51620.15
Organism:
Rattus norvegicus (Rat)
Description:
P43140
Residue:
466
  
Inhibitor
Name:
BDBM50026777
Synonyms:
2-Amino-1-(2,5-dimethoxy-phenyl)-propan-1-ol 2-Amino-1-(2,5-dimethoxy-phenyl)-propan-1-ol(Methoxamine) METHOXAMINE | Vasoxyl
Type:
Small organic molecule
Emp. Form.:
C11H17NO3
Mol. Mass.:
211.2576
SMILES:
COc1ccc(OC)c(c1)C(O)C(C)N
: