Target
5-hydroxytryptamine receptor 1B
Ligand
BDBM81498
Substrate
Ki
0.36±n/a nM
Comments
PDSP_1643
Citation
 Boess, FGMartin, IL Molecular biology of 5-HT receptors. Neuropharmacology 33:275-317 (1994)  
Target
Name:
5-hydroxytryptamine receptor 1B
Synonyms:
5-HT-1B 5-hydroxytryptamine receptor 1B (5HT1B) 5ht1b Serotonin 1 (5-HT1) receptor Serotonin receptor 1B
Type:
Protein
Mol. Mass.:
43173.33
Organism:
Rattus norvegicus (Rat)
Description:
P28564
Residue:
386
  
Inhibitor
Name:
BDBM81498
Synonyms:
5-Methoxy-3-(1,2,3,6-tetrahydro-pyridin-4-yl)-1H-indole(RU-24969) CHEMBL18785 RU 24969
Type:
Small organic molecule
Emp. Form.:
C14H16N2O
Mol. Mass.:
228.2896
SMILES:
COc1ccc2[nH]cc(C3=CCNCC3)c2c1
: