Target
5-hydroxytryptamine receptor 5A
Ligand
BDBM50005835
Substrate
Ki
>10000±n/a nM
Comments
PDSP_1788
Citation
 Boess, FGMartin, IL Molecular biology of 5-HT receptors. Neuropharmacology 33:275-317 (1994)  
Target
Name:
5-hydroxytryptamine receptor 5A
Synonyms:
5-HT-5 5-HT5 5-hydroxytryptamine receptor 5A 5ht5a Serotonin 5a (5-HT5a) receptor | Serotonin receptor 5A
Type:
Enzyme Catalytic Domain
Mol. Mass.:
40749.33
Organism:
MOUSE
Description:
5-HT5 0 MOUSE::P30966
Residue:
357
  
Inhibitor
Name:
BDBM50005835
Synonyms:
(3-[2-(dimethylamino)ethyl]-1H-indol-5-yl)-N-methylmethanesulfonamide 1-{3-[2-(dimethylamino)ethyl]-1H-indol-5-yl}-N-methylmethanesulfonamide 3-[2-(dimethylamino)ethyl]-N-methylindole-5-methanesulfonamide SUMATRIPTAN Sumax
Type:
Small organic molecule
Emp. Form.:
C14H21N3O2S
Mol. Mass.:
295.4
SMILES:
CNS(=O)(=O)Cc1ccc2[nH]cc(CCN(C)C)c2c1
: