Target
Kynurenine/alpha-aminoadipate aminotransferase, mitochondrial
Ligand
BDBM273158
Substrate
Meas. Tech.
KAT-II inhibitory assay
pH
8±n/a
IC50
8.20±n/a nM
Comments
extracted
Citation
 Okuyama, MFukunaga, KUsui, KHayashi, NIijima, DHoriuchi, HItagaki, N Bicyclic or tricyclic heterocyclic compound US Patent  US10065972 Publication Date 9/4/2018 
Target
Name:
Kynurenine/alpha-aminoadipate aminotransferase, mitochondrial
Synonyms:
2-aminoadipate aminotransferase AADAT Alpha-aminoadipate aminotransferase KAT2 Kynurenine aminotransferase II Kynurenine--oxoglutarate aminotransferase II Kynurenine--oxoglutarate transaminase II
Type:
Enzyme
Mol. Mass.:
47353.09
Organism:
Homo sapiens (Human)
Description:
Q8N5Z0
Residue:
425
  
Inhibitor
Name:
BDBM273158
Synonyms:
(R)-N-benzyl-1-(5,5-difluoro-10-oxo-5,7,8,10-tetrahydro-6H-pyrido[1,2-a][1,3]thiazolo[5,4-d]pyrimidin-2-yl)pyrrolidine-2-carboxamide | US10065972, Example 605
Type:
Small organic molecule
Emp. Form.:
C21H21F2N5O2S
Mol. Mass.:
445.486
SMILES:
FC1(F)CCCn2c1nc1sc(nc1c2=O)N1CCC[C@@H]1C(=O)NCc1ccccc1
: