Target
Glucose-6-phosphate dehydrogenase-6-phosphogluconolactonase
Ligand
BDBM34234
Substrate
Meas. Tech.
Dose Response orthogonal assay utilizing the direct end-point detection of NADPH for uHTS small molecule inhibitors of Plasmodium falciparum Glucose-6-phosphate dehydrogenase
IC50
>80000±n/a nM
Citation
 PubChem, PC Dose Response orthogonal assay utilizing the direct end-point detection of NADPH for uHTS small molecule inhibitors of Plasmodium falciparum Glucose-6-phosphate dehydrogenase PubChem Bioassay (2011)[AID] 
Target
Name:
Glucose-6-phosphate dehydrogenase-6-phosphogluconolactonase
Synonyms:
Type:
Enzyme Catalytic Domain
Mol. Mass.:
109731.64
Organism:
Plasmodium falciparum 3D7
Description:
gi_12381848
Residue:
950
  
Inhibitor
Name:
BDBM34234
Synonyms:
4,6-dimethyl-5-prop-2-enyl-2-sulfanylidene-1H-pyridine-3-carbonitrile MLS000038188 cid_657927
Type:
Small organic molecule
Emp. Form.:
C11H12N2S
Mol. Mass.:
204.291
SMILES:
Cc1[nH]c(=S)c(C#N)c(C)c1CC=C
: