Target
Glucose-6-phosphate dehydrogenase-6-phosphogluconolactonase
Ligand
BDBM81086
Substrate
Meas. Tech.
Dose Response orthogonal assay utilizing the direct end-point detection of NADPH for uHTS small molecule inhibitors of Plasmodium falciparum Glucose-6-phosphate dehydrogenase
IC50
62500±n/a nM
Citation
 PubChem, PC Dose Response orthogonal assay utilizing the direct end-point detection of NADPH for uHTS small molecule inhibitors of Plasmodium falciparum Glucose-6-phosphate dehydrogenase PubChem Bioassay (2011)[AID] 
Target
Name:
Glucose-6-phosphate dehydrogenase-6-phosphogluconolactonase
Synonyms:
Type:
Enzyme Catalytic Domain
Mol. Mass.:
109731.64
Organism:
Plasmodium falciparum 3D7
Description:
gi_12381848
Residue:
950
  
Inhibitor
Name:
BDBM81086
Synonyms:
2-(2-thenoylamino)acetic acid [2-keto-2-(4-nitrophenyl)ethyl] ester MLS000712050 [2-(4-nitrophenyl)-2-oxidanylidene-ethyl] 2-(thiophen-2-ylcarbonylamino)ethanoate cid_1606822
Type:
Small organic molecule
Emp. Form.:
C15H12N2O6S
Mol. Mass.:
348.331
SMILES:
[O-][N+](=O)c1ccc(cc1)C(=O)COC(=O)CNC(=O)c1cccs1
: