Target
Glucose-6-phosphate dehydrogenase-6-phosphogluconolactonase
Ligand
BDBM29632
Substrate
Meas. Tech.
Dose Response orthogonal kinetic assay utilizing the direct detection of NADPH for uHTS small molecule inhibitors of Plasmodium falciparum Glucose-6-phosphate dehydrogenase
IC50
31300±n/a nM
Citation
 PubChem, PC Dose Response orthogonal kinetic assay utilizing the direct detection of NADPH for uHTS small molecule inhibitors of Plasmodium falciparum Glucose-6-phosphate dehydrogenase PubChem Bioassay (2011)[AID] 
Target
Name:
Glucose-6-phosphate dehydrogenase-6-phosphogluconolactonase
Synonyms:
Type:
Enzyme Catalytic Domain
Mol. Mass.:
109731.64
Organism:
Plasmodium falciparum 3D7
Description:
gi_12381848
Residue:
950
  
Inhibitor
Name:
BDBM29632
Synonyms:
2-[2-(3-keto-1,2-benzothiazol-2-yl)thiazol-4-yl]acetic acid ethyl ester MLS000082162 cid_2328662 ethyl 2-[2-(3-oxo-1,2-benzothiazol-2-yl)-1,3-thiazol-4-yl]acetate
Type:
Small organic molecule
Emp. Form.:
C14H12N2O3S2
Mol. Mass.:
320.387
SMILES:
CCOC(=O)Cc1csc(n1)-n1sc2ccccc2c1=O
: