Target
Glucose-6-phosphate dehydrogenase-6-phosphogluconolactonase
Ligand
BDBM38617
Substrate
Meas. Tech.
Dose Response orthogonal kinetic assay utilizing the direct detection of NADPH for uHTS small molecule inhibitors of Plasmodium falciparum Glucose-6-phosphate dehydrogenase
IC50
15700±n/a nM
Citation
 PubChem, PC Dose Response orthogonal kinetic assay utilizing the direct detection of NADPH for uHTS small molecule inhibitors of Plasmodium falciparum Glucose-6-phosphate dehydrogenase PubChem Bioassay (2011)[AID] 
Target
Name:
Glucose-6-phosphate dehydrogenase-6-phosphogluconolactonase
Synonyms:
Type:
Enzyme Catalytic Domain
Mol. Mass.:
109731.64
Organism:
Plasmodium falciparum 3D7
Description:
gi_12381848
Residue:
950
  
Inhibitor
Name:
BDBM38617
Synonyms:
MLS000092916 N-[2-(diethylamino)ethyl]-5-(8-methoxy-4-oxidanylidene-2-sulfanylidene-1,5-dihydropyrimido[5,4-b]indol-3-yl)pentanamide N-[2-(diethylamino)ethyl]-5-(8-methoxy-4-oxo-2-thioxo-1,2,4,5-tetrahydro-3H-pyrimido[5,4-b]indol-3-yl)pentanamide cid_3244883
Type:
Small organic molecule
Emp. Form.:
C22H31N5O3S
Mol. Mass.:
445.578
SMILES:
CCN(CC)CCNC(=O)CCCCn1c(=S)[nH]c2c3cc(OC)ccc3[nH]c2c1=O
: