Target
Glucose-6-phosphate dehydrogenase-6-phosphogluconolactonase
Ligand
BDBM80725
Substrate
Meas. Tech.
Dose Response orthogonal kinetic assay utilizing the direct detection of NADPH for uHTS small molecule inhibitors of Plasmodium falciparum Glucose-6-phosphate dehydrogenase
IC50
34700±n/a nM
Citation
 PubChem, PC Dose Response orthogonal kinetic assay utilizing the direct detection of NADPH for uHTS small molecule inhibitors of Plasmodium falciparum Glucose-6-phosphate dehydrogenase PubChem Bioassay (2011)[AID] 
Target
Name:
Glucose-6-phosphate dehydrogenase-6-phosphogluconolactonase
Synonyms:
Type:
Enzyme Catalytic Domain
Mol. Mass.:
109731.64
Organism:
Plasmodium falciparum 3D7
Description:
gi_12381848
Residue:
950
  
Inhibitor
Name:
BDBM80725
Synonyms:
2,3-bis(p-tolylthio)-1,4-naphthoquinone 2,3-bis[(4-methylphenyl)thio]naphthalene-1,4-dione SMR000528799 | cid_312601
Type:
Small organic molecule
Emp. Form.:
C24H18O2S2
Mol. Mass.:
402.529
SMILES:
Cc1ccc(SC2=C(Sc3ccc(C)cc3)C(=O)c3ccccc3C2=O)cc1
: