Target
Carboxy-terminal domain RNA polymerase II polypeptide A small phosphatase 1
Ligand
BDBM82692
Substrate
Meas. Tech.
Dose Response confirmation of uHTS hits for Scp-1 phosphatase using a colorimetric assay
IC50
1700±134 nM
Citation
 PubChem, PC Dose Response confirmation of uHTS hits for Scp-1 phosphatase using a colorimetric assay PubChem Bioassay (2011)[AID] 
Target
Name:
Carboxy-terminal domain RNA polymerase II polypeptide A small phosphatase 1
Synonyms:
CTDS1_HUMAN NIF3 SCP1 | carboxy-terminal domain RNA polymerase II polypeptide A small phosphatase 1 isoform 1
Type:
Enzyme Catalytic Domain
Mol. Mass.:
29199.89
Organism:
Homo sapiens (Human)
Description:
gi_10864009
Residue:
261
  
Inhibitor
Name:
BDBM82692
Synonyms:
3-(3-nitrophenyl)-N'-[(1E)-1-(6-oxidanylidenecyclohexa-2,4-dien-1-ylidene)ethyl]-1H-pyrazole-5-carbohydrazide 3-(3-nitrophenyl)-N'-[(1E)-1-(6-oxocyclohexa-2,4-dien-1-ylidene)ethyl]-1H-pyrazole-5-carbohydrazide N'-[1-(2-hydroxyphenyl)ethylidene]-3-(3-nitrophenyl)-1H-pyrazole-5-carbohydrazide SMR000193754 | cid_5345538
Type:
Small organic molecule
Emp. Form.:
C18H15N5O4
Mol. Mass.:
365.3428
SMILES:
CC(=[NH+]NC(=O)c1cc(n[nH]1)-c1cccc(c1)[N+]([O-])=O)[c-]1ccccc1=O
: