Target
Carboxy-terminal domain RNA polymerase II polypeptide A small phosphatase 1
Ligand
BDBM60080
Substrate
Meas. Tech.
Dose Response confirmation of uHTS hits for Scp-1 phosphatase using a colorimetric assay
IC50
16129±1580 nM
Citation
 PubChem, PC Dose Response confirmation of uHTS hits for Scp-1 phosphatase using a colorimetric assay PubChem Bioassay (2011)[AID] 
Target
Name:
Carboxy-terminal domain RNA polymerase II polypeptide A small phosphatase 1
Synonyms:
CTDS1_HUMAN NIF3 SCP1 | carboxy-terminal domain RNA polymerase II polypeptide A small phosphatase 1 isoform 1
Type:
Enzyme Catalytic Domain
Mol. Mass.:
29199.89
Organism:
Homo sapiens (Human)
Description:
gi_10864009
Residue:
261
  
Inhibitor
Name:
BDBM60080
Synonyms:
2-[(3-carbethoxy-4,5,6,7-tetrahydrobenzothiophen-2-yl)carbamoyl]-3-methyl-bicyclo[2.2.1]hept-5-ene-3-carboxylic acid 2-[(3-ethoxycarbonyl-4,5,6,7-tetrahydro-1-benzothiophen-2-yl)carbamoyl]-3-methylbicyclo[2.2.1]hept-5-ene-3-carboxylic acid 3-({[3-(ethoxycarbonyl)-4,5,6,7-tetrahydro-1-benzothien-2-yl]amino}carbonyl)-2-methylbicyclo[2.2.1]hept-5-ene-2-carboxylic acid SMR000300173 | cid_2956806
Type:
Small organic molecule
Emp. Form.:
C21H25NO5S
Mol. Mass.:
403.492
SMILES:
[H]C12CC([H])(C=C1)C(C)(C2C(=O)Nc1sc2CCCCc2c1C(=O)OCC)C(O)=O
: