Target
Carboxy-terminal domain RNA polymerase II polypeptide A small phosphatase 1
Ligand
BDBM50513
Substrate
Meas. Tech.
Dose Response confirmation of uHTS hits for Scp-1 phosphatase using a colorimetric assay
IC50
1120±48 nM
Citation
 PubChem, PC Dose Response confirmation of uHTS hits for Scp-1 phosphatase using a colorimetric assay PubChem Bioassay (2011)[AID] 
Target
Name:
Carboxy-terminal domain RNA polymerase II polypeptide A small phosphatase 1
Synonyms:
CTDS1_HUMAN NIF3 SCP1 | carboxy-terminal domain RNA polymerase II polypeptide A small phosphatase 1 isoform 1
Type:
Enzyme Catalytic Domain
Mol. Mass.:
29199.89
Organism:
Homo sapiens (Human)
Description:
gi_10864009
Residue:
261
  
Inhibitor
Name:
BDBM50513
Synonyms:
4-(2,6-bis(3,4-dimethylphenyl)-1,3,5,7-tetraoxo-1,2,3,5,6,7-hexahydropyrrolo[3,4-f]isoindole-4-carbonyl)benzoic acid 4-[2,6-bis(3,4-dimethylphenyl)-1,3,5,7-tetrakis(oxidanylidene)pyrrolo[3,4-f]isoindol-8-yl]carbonylbenzoic acid 4-[[2,6-bis(3,4-dimethylphenyl)-1,3,5,7-tetraoxo-8-pyrrolo[3,4-f]isoindolyl]-oxomethyl]benzoic acid MLS000714384 cid_3108985
Type:
Small organic molecule
Emp. Form.:
C34H24N2O7
Mol. Mass.:
572.5636
SMILES:
Cc1ccc(cc1C)-n1c(=O)c2cc3c(c(C(=O)c4ccc(cc4)C(O)=O)c2c1=O)c(=O)n(-c1ccc(C)c(C)c1)c3=O
: