Target
Carboxy-terminal domain RNA polymerase II polypeptide A small phosphatase 1
Ligand
BDBM82923
Substrate
Meas. Tech.
Dose Response confirmation of uHTS hits for Scp-1 phosphatase using a colorimetric assay
IC50
1879±100 nM
Citation
 PubChem, PC Dose Response confirmation of uHTS hits for Scp-1 phosphatase using a colorimetric assay PubChem Bioassay (2011)[AID] 
Target
Name:
Carboxy-terminal domain RNA polymerase II polypeptide A small phosphatase 1
Synonyms:
CTDS1_HUMAN NIF3 SCP1 | carboxy-terminal domain RNA polymerase II polypeptide A small phosphatase 1 isoform 1
Type:
Enzyme Catalytic Domain
Mol. Mass.:
29199.89
Organism:
Homo sapiens (Human)
Description:
gi_10864009
Residue:
261
  
Inhibitor
Name:
BDBM82923
Synonyms:
4-[3-[(5Z)-5-(4-ethoxybenzylidene)-4-keto-2-thioxo-thiazolidin-3-yl]propanoylamino]benzoic acid 4-[3-[(5Z)-5-[(4-ethoxyphenyl)methylidene]-4-oxo-2-sulfanylidene-1,3-thiazolidin-3-yl]propanoylamino]benzoic acid 4-{3-[5-(4-Ethoxy-benzylidene)-4-oxo-2-thioxo-thiazolidin-3-yl]-propionylamino}-benzoic acid SMR000517820 | cid_1580468
Type:
Small organic molecule
Emp. Form.:
C22H20N2O5S2
Mol. Mass.:
456.535
SMILES:
CCOc1ccc(\C=C2/SC(=S)N(CCC(=O)Nc3ccc(cc3)C(O)=O)C2=O)cc1
: