Target
Carboxy-terminal domain RNA polymerase II polypeptide A small phosphatase 1
Ligand
BDBM66141
Substrate
Meas. Tech.
Dose Response confirmation of uHTS hits for Scp-1 phosphatase using a colorimetric assay
IC50
1227±40 nM
Citation
 PubChem, PC Dose Response confirmation of uHTS hits for Scp-1 phosphatase using a colorimetric assay PubChem Bioassay (2011)[AID] 
Target
Name:
Carboxy-terminal domain RNA polymerase II polypeptide A small phosphatase 1
Synonyms:
CTDS1_HUMAN NIF3 SCP1 | carboxy-terminal domain RNA polymerase II polypeptide A small phosphatase 1 isoform 1
Type:
Enzyme Catalytic Domain
Mol. Mass.:
29199.89
Organism:
Homo sapiens (Human)
Description:
gi_10864009
Residue:
261
  
Inhibitor
Name:
BDBM66141
Synonyms:
5-Nitro-furan-2-carboxylic acid [2-(2-fluoro-phenyl)-benzooxazol-5-yl]-amide N-[2-(2-fluorophenyl)-1,3-benzoxazol-5-yl]-5-nitro-2-furamide N-[2-(2-fluorophenyl)-1,3-benzoxazol-5-yl]-5-nitro-furan-2-carboxamide SMR000554884 | cid_3116398
Type:
Small organic molecule
Emp. Form.:
C18H10FN3O5
Mol. Mass.:
367.2875
SMILES:
[O-][N+](=O)c1ccc(o1)C(=O)Nc1ccc2oc(nc2c1)-c1ccccc1F
: