Target
Carboxy-terminal domain RNA polymerase II polypeptide A small phosphatase 1
Ligand
BDBM83163
Substrate
Meas. Tech.
Dose Response confirmation of uHTS hits for Scp-1 phosphatase using a colorimetric assay
IC50
1615±136 nM
Citation
 PubChem, PC Dose Response confirmation of uHTS hits for Scp-1 phosphatase using a colorimetric assay PubChem Bioassay (2011)[AID] 
Target
Name:
Carboxy-terminal domain RNA polymerase II polypeptide A small phosphatase 1
Synonyms:
CTDS1_HUMAN NIF3 SCP1 | carboxy-terminal domain RNA polymerase II polypeptide A small phosphatase 1 isoform 1
Type:
Enzyme Catalytic Domain
Mol. Mass.:
29199.89
Organism:
Homo sapiens (Human)
Description:
gi_10864009
Residue:
261
  
Inhibitor
Name:
BDBM83163
Synonyms:
5,6-dihydro-4H-cyclopenta[b]thiophen-2-yl-[4-(4-methoxyphenyl)sulfonyl-1-piperazinyl]methanone 5,6-dihydro-4H-cyclopenta[b]thiophen-2-yl-[4-(4-methoxyphenyl)sulfonylpiperazino]methanone SMR001316142 | cid_4790991
Type:
Small organic molecule
Emp. Form.:
C19H22N2O4S2
Mol. Mass.:
406.519
SMILES:
COc1ccc(cc1)S(=O)(=O)N1CCN(CC1)C(=O)c1cc2CCCc2s1
: