Target
C-C chemokine receptor type 6
Ligand
BDBM83206
Substrate
Meas. Tech.
SAR analysis of small molecule antagonists of the CCR6 receptor: a luminescent beta-arrestin assay
IC50
>66600±n/a nM
Citation
 PubChem, PC SAR analysis of small molecule antagonists of the CCR6 receptor: a luminescent beta-arrestin assay PubChem Bioassay (2011)[AID] 
Target
Name:
C-C chemokine receptor type 6
Synonyms:
C-C chemokine receptor type 6 CCR6 CKRL3 GPR29 | STRL22
Type:
Enzyme
Mol. Mass.:
42510.84
Organism:
Homo sapiens (Human)
Description:
P51684
Residue:
374
  
Inhibitor
Name:
BDBM83206
Synonyms:
1-[3-(4-tert-butylphenoxy)propyl]-7-methyl-indole-2,3-dione 1-[3-(4-tert-butylphenoxy)propyl]-7-methylindole-2,3-dione cid_3372218
Type:
Small organic molecule
Emp. Form.:
C22H25NO3
Mol. Mass.:
351.4388
SMILES:
Cc1cccc2C(=O)C(=O)N(CCCOc3ccc(cc3)C(C)(C)C)c12
: