Target
Toll-like receptor 9
Ligand
BDBM83217
Substrate
Meas. Tech.
Fluorescence-based cell-based high throughput dose response assay for inhibitors of TLR9-MyD88 binding
IC50
3069±n/a nM
Citation
 PubChem, PC Fluorescence-based cell-based high throughput dose response assay for inhibitors of TLR9-MyD88 binding PubChem Bioassay (2011)[AID] 
Target
Name:
Toll-like receptor 9
Synonyms:
CD_antigen: CD289 TLR9_HUMAN
Type:
Enzyme
Mol. Mass.:
115889.91
Organism:
Homo sapiens (Human)
Description:
Q9NR96
Residue:
1032
  
Inhibitor
Name:
BDBM83217
Synonyms:
4-[4-(6,8-dibromo-2-quinolinyl)phenyl]morpholine 4-[4-(6,8-dibromoquinolin-2-yl)phenyl]morpholine 6,8-dibromo-2-(4-morpholinophenyl)quinoline SMR000180265 | cid_1472977
Type:
Small organic molecule
Emp. Form.:
C19H16Br2N2O
Mol. Mass.:
448.151
SMILES:
Brc1cc(Br)c2nc(ccc2c1)-c1ccc(cc1)N1CCOCC1
: