Target
Toll-like receptor 9
Ligand
BDBM33120
Substrate
Meas. Tech.
Fluorescence-based cell-based high throughput dose response assay for inhibitors of TLR9-MyD88 binding
IC50
3565±n/a nM
Citation
 PubChem, PC Fluorescence-based cell-based high throughput dose response assay for inhibitors of TLR9-MyD88 binding PubChem Bioassay (2011)[AID] 
Target
Name:
Toll-like receptor 9
Synonyms:
CD_antigen: CD289 TLR9_HUMAN
Type:
Enzyme
Mol. Mass.:
115889.91
Organism:
Homo sapiens (Human)
Description:
Q9NR96
Residue:
1032
  
Inhibitor
Name:
BDBM33120
Synonyms:
2-({7-[(1-methyl-1H-imidazol-2-yl)thio]-4-nitro-2,1,3-benzoxadiazol-5-yl}amino)ethyl butyrate MLS000584441 butanoic acid 2-[[7-[(1-methyl-2-imidazolyl)thio]-4-nitro-2,1,3-benzoxadiazol-5-yl]amino]ethyl ester cid_12005312
Type:
Small organic molecule
Emp. Form.:
C16H18N6O5S
Mol. Mass.:
406.416
SMILES:
CCCC(=O)OCCNc1cc(Sc2nccn2C)c2nonc2c1[N+]([O-])=O
: