Target
Toll-like receptor 9
Ligand
BDBM54818
Substrate
Meas. Tech.
Fluorescence-based cell-based high throughput dose response assay for inhibitors of TLR9-MyD88 binding
IC50
2951±n/a nM
Citation
 PubChem, PC Fluorescence-based cell-based high throughput dose response assay for inhibitors of TLR9-MyD88 binding PubChem Bioassay (2011)[AID] 
Target
Name:
Toll-like receptor 9
Synonyms:
CD_antigen: CD289 TLR9_HUMAN
Type:
Enzyme
Mol. Mass.:
115889.91
Organism:
Homo sapiens (Human)
Description:
Q9NR96
Residue:
1032
  
Inhibitor
Name:
BDBM54818
Synonyms:
(7-chloro-4-nitro-benzofurazan-5-yl)-methyl-amine 7-chloro-N-methyl-4-nitro-2,1,3-benzoxadiazol-5-amine SMR000285240 | cid_3128197
Type:
Small organic molecule
Emp. Form.:
C7H5ClN4O3
Mol. Mass.:
228.593
SMILES:
CNc1cc(Cl)c2nonc2c1[N+]([O-])=O
: