Target
Toll-like receptor 9
Ligand
BDBM65733
Substrate
Meas. Tech.
Fluorescence-based cell-based high throughput dose response assay for inhibitors of TLR9-MyD88 binding
IC50
11516±n/a nM
Citation
 PubChem, PC Fluorescence-based cell-based high throughput dose response assay for inhibitors of TLR9-MyD88 binding PubChem Bioassay (2011)[AID] 
Target
Name:
Toll-like receptor 9
Synonyms:
CD_antigen: CD289 TLR9_HUMAN
Type:
Enzyme
Mol. Mass.:
115889.91
Organism:
Homo sapiens (Human)
Description:
Q9NR96
Residue:
1032
  
Inhibitor
Name:
BDBM65733
Synonyms:
3-methyl-8-nitro-7-(phenylmethyl)purine-2,6-dione 7-benzyl-3-methyl-8-nitropurine-2,6-dione cid_909915
Type:
Small organic molecule
Emp. Form.:
C13H11N5O4
Mol. Mass.:
301.2575
SMILES:
Cn1c2nc(n(Cc3ccccc3)c2c(=O)[nH]c1=O)[N+]([O-])=O
: