Target
Toll-like receptor 9
Ligand
BDBM73825
Substrate
Meas. Tech.
Fluorescence-based cell-based high throughput dose response assay for inhibitors of TLR9-MyD88 binding
IC50
4091±n/a nM
Citation
 PubChem, PC Fluorescence-based cell-based high throughput dose response assay for inhibitors of TLR9-MyD88 binding PubChem Bioassay (2011)[AID] 
Target
Name:
Toll-like receptor 9
Synonyms:
CD_antigen: CD289 TLR9_HUMAN
Type:
Enzyme
Mol. Mass.:
115889.91
Organism:
Homo sapiens (Human)
Description:
Q9NR96
Residue:
1032
  
Inhibitor
Name:
BDBM73825
Synonyms:
6-amino-2-(3-methylbutyl)-1H-benzo[de]isoquinoline-1,3(2H)-dione, Un-nameable (empty structure) 6-amino-2-isoamyl-benzo[de]isoquinoline-1,3-quinone MLS001143836 cid_3089611
Type:
Small organic molecule
Emp. Form.:
C17H18N2O2
Mol. Mass.:
282.337
SMILES:
CC(C)CCN1C(=O)c2cccc3c(N)ccc(C1=O)c23
: