Target
Toll-like receptor 9
Ligand
BDBM33080
Substrate
Meas. Tech.
Fluorescence-based cell-based high throughput dose response assay for inhibitors of TLR9-MyD88 binding
IC50
6365±n/a nM
Citation
 PubChem, PC Fluorescence-based cell-based high throughput dose response assay for inhibitors of TLR9-MyD88 binding PubChem Bioassay (2011)[AID] 
Target
Name:
Toll-like receptor 9
Synonyms:
CD_antigen: CD289 TLR9_HUMAN
Type:
Enzyme
Mol. Mass.:
115889.91
Organism:
Homo sapiens (Human)
Description:
Q9NR96
Residue:
1032
  
Inhibitor
Name:
BDBM33080
Synonyms:
2-[[7-(1,3-benzothiazol-2-ylsulfanyl)-4-nitro-2,1,3-benzoxadiazol-5-yl]amino]ethyl propanoate SMR000131460 propanoic acid 2-[[7-(1,3-benzothiazol-2-ylthio)-4-nitro-2,1,3-benzoxadiazol-5-yl]amino]ethyl ester | propionic acid 2-[[7-(1,3-benzothiazol-2-ylthio)-4-nitro-benzofurazan-5-yl]amino]ethyl ester
Type:
Small organic molecule
Emp. Form.:
C18H15N5O5S2
Mol. Mass.:
445.472
SMILES:
CCC(=O)OCCNc1cc(Sc2nc3ccccc3s2)c2nonc2c1[N+]([O-])=O
: