Target
Toll-like receptor 9
Ligand
BDBM81263
Substrate
Meas. Tech.
Fluorescence-based cell-based high throughput dose response assay for inhibitors of TLR9-MyD88 binding
IC50
1509±n/a nM
Citation
 PubChem, PC Fluorescence-based cell-based high throughput dose response assay for inhibitors of TLR9-MyD88 binding PubChem Bioassay (2011)[AID] 
Target
Name:
Toll-like receptor 9
Synonyms:
CD_antigen: CD289 TLR9_HUMAN
Type:
Enzyme
Mol. Mass.:
115889.91
Organism:
Homo sapiens (Human)
Description:
Q9NR96
Residue:
1032
  
Inhibitor
Name:
BDBM81263
Synonyms:
Brilliant green SMR001224398 [4-[[4-(diethylamino)phenyl]-phenyl-methylidene]cyclohexa-2,5-dien-1-ylidene]-diethyl-azanium;sulfuric acid [4-[[4-(diethylamino)phenyl]-phenylmethylidene]cyclohexa-2,5-dien-1-ylidene]-diethylazanium;sulfuric acid | cid_407401
Type:
Small organic molecule
Emp. Form.:
C27H33N2
Mol. Mass.:
385.5638
SMILES:
CCN(CC)c1ccc(cc1)[C+](c1ccccc1)c1ccc(cc1)N(CC)CC
: