Target
Beta-lactamase
Ligand
BDBM33098
Substrate
Meas. Tech.
Counterscreen for inhibitors of TLR9-MyD88 binding: fluorescence-based cell-based high throughput dose response assay to identify non-selective inhibitors of the beta-lactamase enzyme (BLA)
IC50
9167±n/a nM
Citation
 PubChem, PC Counterscreen for inhibitors of TLR9-MyD88 binding: fluorescence-based cell-based high throughput dose response assay to identify non-selective inhibitors of the beta-lactamase enzyme (BLA) PubChem Bioassay (2011)[AID] 
Target
Name:
Beta-lactamase
Synonyms:
Beta lactamase
Type:
Enzyme Catalytic Domain
Mol. Mass.:
31513.38
Organism:
Pseudomonas aeruginosa
Description:
gi_114881106
Residue:
286
  
Inhibitor
Name:
BDBM33098
Synonyms:
2-[[7-(1,3-benzothiazol-2-ylsulfanyl)-4-nitro-2,1,3-benzoxadiazol-5-yl]amino]ethanol 2-[[7-(1,3-benzothiazol-2-ylthio)-4-nitro-benzofurazan-5-yl]amino]ethanol SMR000131402 | cid_11957260
Type:
Small organic molecule
Emp. Form.:
C15H11N5O4S2
Mol. Mass.:
389.409
SMILES:
OCCNc1cc(Sc2nc3ccccc3s2)c2nonc2c1[N+]([O-])=O
: