Target
Apelin receptor
Ligand
BDBM72680
Substrate
Meas. Tech.
SAR analysis counterscreen of small molecule antagonists of the CCR6 receptor using an APJ receptor luminescent beta-arrestin assay
IC50
7220±n/a nM
Citation
 PubChem, PC SAR analysis counterscreen of small molecule antagonists of the CCR6 receptor using an APJ receptor luminescent beta-arrestin assay PubChem Bioassay (2011)[AID] 
Target
Name:
Apelin receptor
Synonyms:
AGTRL1 APJ_HUMAN Angiotensin receptor-like 1 Apelin receptor (APJ) G-protein coupled receptor HG11
Type:
Enzyme Catalytic Domain
Mol. Mass.:
42664.06
Organism:
Homo sapiens (Human)
Description:
P35414
Residue:
380
  
Inhibitor
Name:
BDBM72680
Synonyms:
5-[5-(4-Chloro-phenyl)-pyrazolidin-3-ylidene]-1,3-dimethyl-pyrimidine-2,4,6-trione 5-[5-(4-chlorophenyl)pyrazolidin-3-ylidene]-1,3-dimethyl-1,3-diazinane-2,4,6-trione MLS000762999 cid_6224486
Type:
Small organic molecule
Emp. Form.:
C15H15ClN4O3
Mol. Mass.:
334.758
SMILES:
CN1C(=O)C(C2CC(N=N2)c2ccc(Cl)cc2)C(=O)N(C)C1=O
: