Target
Delta-type opioid receptor
Ligand
BDBM67709
Substrate
Meas. Tech.
Counterscreen for agonists of heterodimerization of the mu 1 (OPRM1) and delta 1 (OPRD1) opioid receptors: Luminescence-based cell-based high throughput dose response assay
EC50
>92526±n/a nM
Citation
 PubChem, PC Counterscreen for agonists of heterodimerization of the mu 1 (OPRM1) and delta 1 (OPRD1) opioid receptors: Luminescence-based cell-based high throughput dose response assay to identify agonists of OPRD1 homodimerization PubChem Bioassay (2011)[AID] 
Target
Name:
Delta-type opioid receptor
Synonyms:
D-OR-1 Delta opioid receptor OPIATE Delta OPRD1 OPRK1 | opioid receptor, delta 1
Type:
G Protein-Coupled Receptor (GPCR)
Mol. Mass.:
40382.98
Organism:
Homo sapiens (Human)
Description:
Competition binding assays were carried out using membrane preparations from transfected HN9.10 cells that constitutively expressed the delta opioid receptor.
Residue:
372
  
Inhibitor
Name:
BDBM67709
Synonyms:
4-(2-Aza-spiro[5.5]undecane-2-sulfonyl)-N-cyclopropyl-benzenesulfonamide 4-(2-azaspiro[5.5]undecan-2-ylsulfonyl)-N-cyclopropylbenzenesulfonamide SMR000003732 | cid_653596
Type:
Small organic molecule
Emp. Form.:
C19H28N2O4S2
Mol. Mass.:
412.567
SMILES:
O=S(=O)(NC1CC1)c1ccc(cc1)S(=O)(=O)N1CCCC2(CCCCC2)C1
: