Target
Delta-type opioid receptor
Ligand
BDBM83308
Substrate
Meas. Tech.
Counterscreen for agonists of heterodimerization of the mu 1 (OPRM1) and delta 1 (OPRD1) opioid receptors: Luminescence-based cell-based high throughput dose response assay
EC50
11628±n/a nM
Citation
 PubChem, PC Counterscreen for agonists of heterodimerization of the mu 1 (OPRM1) and delta 1 (OPRD1) opioid receptors: Luminescence-based cell-based high throughput dose response assay to identify agonists of OPRD1 homodimerization PubChem Bioassay (2011)[AID] 
Target
Name:
Delta-type opioid receptor
Synonyms:
D-OR-1 Delta opioid receptor OPIATE Delta OPRD1 OPRK1 | opioid receptor, delta 1
Type:
G Protein-Coupled Receptor (GPCR)
Mol. Mass.:
40382.98
Organism:
Homo sapiens (Human)
Description:
Competition binding assays were carried out using membrane preparations from transfected HN9.10 cells that constitutively expressed the delta opioid receptor.
Residue:
372
  
Inhibitor
Name:
BDBM83308
Synonyms:
2-amino-1-(3-cyano-4,5,6,7-tetrahydro-1-benzothiophen-2-yl)-4-(4-methoxyphenyl)-7,7-dimethyl-5-oxo-1,4,5,6,7,8-hexahydro-3-quinolinecarbonitrile 2-amino-1-(3-cyano-4,5,6,7-tetrahydrobenzothiophen-2-yl)-5-keto-4-(4-methoxyphenyl)-7,7-dimethyl-6,8-dihydro-4H-quinoline-3-carbonitrile MLS000324866 cid_3863202
Type:
Small organic molecule
Emp. Form.:
C28H28N4O2S
Mol. Mass.:
484.613
SMILES:
COc1ccc(cc1)C1C(C#N)C(=N)N(c2sc3CCCCc3c2C#N)C2=C1C(=O)CC(C)(C)C2
: