Target
Delta-type opioid receptor
Ligand
BDBM83387
Substrate
Meas. Tech.
Counterscreen for agonists of heterodimerization of the mu 1 (OPRM1) and delta 1 (OPRD1) opioid receptors: Luminescence-based cell-based high throughput dose response assay
EC50
>92480±n/a nM
Citation
 PubChem, PC Counterscreen for agonists of heterodimerization of the mu 1 (OPRM1) and delta 1 (OPRD1) opioid receptors: Luminescence-based cell-based high throughput dose response assay to identify agonists of OPRD1 homodimerization PubChem Bioassay (2011)[AID] 
Target
Name:
Delta-type opioid receptor
Synonyms:
D-OR-1 Delta opioid receptor OPIATE Delta OPRD1 OPRK1 | opioid receptor, delta 1
Type:
G Protein-Coupled Receptor (GPCR)
Mol. Mass.:
40382.98
Organism:
Homo sapiens (Human)
Description:
Competition binding assays were carried out using membrane preparations from transfected HN9.10 cells that constitutively expressed the delta opioid receptor.
Residue:
372
  
Inhibitor
Name:
BDBM83387
Synonyms:
1-(2-Methoxy-benzyl)-4-[3-methyl-1-(1-thiophen-2-ylmethyl-1H-tetrazol-5-yl)-butyl]-piperazine 1-[(2-methoxyphenyl)methyl]-4-[3-methyl-1-[1-(thiophen-2-ylmethyl)-5-tetrazolyl]butyl]piperazine;hydrochloride 1-[3-methyl-1-[1-(2-thenyl)tetrazol-5-yl]butyl]-4-o-anisyl-piperazine;hydrochloride SMR000005041 | cid_6603071
Type:
Small organic molecule
Emp. Form.:
C23H32N6OS
Mol. Mass.:
440.605
SMILES:
COc1ccccc1CN1CCN(CC1)C(CC(C)C)c1nnnn1Cc1cccs1
: