Target
Delta-type opioid receptor
Ligand
BDBM66946
Substrate
Meas. Tech.
Counterscreen for agonists of heterodimerization of the mu 1 (OPRM1) and delta 1 (OPRD1) opioid receptors: Luminescence-based cell-based high throughput dose response assay
EC50
>92489±n/a nM
Citation
 PubChem, PC Counterscreen for agonists of heterodimerization of the mu 1 (OPRM1) and delta 1 (OPRD1) opioid receptors: Luminescence-based cell-based high throughput dose response assay to identify agonists of OPRD1 homodimerization PubChem Bioassay (2011)[AID] 
Target
Name:
Delta-type opioid receptor
Synonyms:
D-OR-1 Delta opioid receptor OPIATE Delta OPRD1 OPRK1 | opioid receptor, delta 1
Type:
G Protein-Coupled Receptor (GPCR)
Mol. Mass.:
40382.98
Organism:
Homo sapiens (Human)
Description:
Competition binding assays were carried out using membrane preparations from transfected HN9.10 cells that constitutively expressed the delta opioid receptor.
Residue:
372
  
Inhibitor
Name:
BDBM66946
Synonyms:
4-(3,4-dihydro-1H-isoquinolin-2-ylsulfonyl)-N-[3-(dimethylamino)propyl]-N-(6-fluoranyl-1,3-benzothiazol-2-yl)benzamide;hydrochloride MLS001239379 cid_24892079
Type:
Small organic molecule
Emp. Form.:
C28H29FN4O3S2
Mol. Mass.:
552.683
SMILES:
CN(C)CCCN(C(=O)c1ccc(cc1)S(=O)(=O)N1CCc2ccccc2C1)c1nc2ccc(F)cc2s1
: