Target
Delta-type opioid receptor
Ligand
BDBM83446
Substrate
Meas. Tech.
Counterscreen for agonists of heterodimerization of the mu 1 (OPRM1) and delta 1 (OPRD1) opioid receptors: Luminescence-based cell-based high throughput dose response assay
EC50
>92480±n/a nM
Citation
 PubChem, PC Counterscreen for agonists of heterodimerization of the mu 1 (OPRM1) and delta 1 (OPRD1) opioid receptors: Luminescence-based cell-based high throughput dose response assay to identify agonists of OPRD1 homodimerization PubChem Bioassay (2011)[AID] 
Target
Name:
Delta-type opioid receptor
Synonyms:
D-OR-1 Delta opioid receptor OPIATE Delta OPRD1 OPRK1 | opioid receptor, delta 1
Type:
G Protein-Coupled Receptor (GPCR)
Mol. Mass.:
40382.98
Organism:
Homo sapiens (Human)
Description:
Competition binding assays were carried out using membrane preparations from transfected HN9.10 cells that constitutively expressed the delta opioid receptor.
Residue:
372
  
Inhibitor
Name:
BDBM83446
Synonyms:
1-pyrrolidinecarbodithioic acid [2-[[2-(dimethylamino)-2-phenylethyl]amino]-2-oxoethyl] ester SMR001313760 [2-[[2-(dimethylamino)-2-phenylethyl]amino]-2-oxoethyl] pyrrolidine-1-carbodithioate pyrrolidine-1-carbodithioic acid [2-[[2-(dimethylamino)-2-phenyl-ethyl]amino]-2-keto-ethyl] ester
Type:
Small organic molecule
Emp. Form.:
C17H25N3OS2
Mol. Mass.:
351.53
SMILES:
CN(C)C(CNC(=O)CSC(=S)N1CCCC1)c1ccccc1
: