Target
Delta-type opioid receptor
Ligand
BDBM83452
Substrate
Meas. Tech.
Counterscreen for agonists of heterodimerization of the mu 1 (OPRM1) and delta 1 (OPRD1) opioid receptors: Luminescence-based cell-based high throughput dose response assay
EC50
86441±n/a nM
Citation
 PubChem, PC Counterscreen for agonists of heterodimerization of the mu 1 (OPRM1) and delta 1 (OPRD1) opioid receptors: Luminescence-based cell-based high throughput dose response assay to identify agonists of OPRD1 homodimerization PubChem Bioassay (2011)[AID] 
Target
Name:
Delta-type opioid receptor
Synonyms:
D-OR-1 Delta opioid receptor OPIATE Delta OPRD1 OPRK1 | opioid receptor, delta 1
Type:
G Protein-Coupled Receptor (GPCR)
Mol. Mass.:
40382.98
Organism:
Homo sapiens (Human)
Description:
Competition binding assays were carried out using membrane preparations from transfected HN9.10 cells that constitutively expressed the delta opioid receptor.
Residue:
372
  
Inhibitor
Name:
BDBM83452
Synonyms:
(+)--alpha--Propoxyphene hydrochloride SMR001338871 [(3R)-4-(dimethylamino)-3-methyl-1,2-diphenylbutan-2-yl] propanoate;hydrochloride propanoic acid [(3R)-4-(dimethylamino)-3-methyl-1,2-diphenylbutan-2-yl] ester;hydrochloride | propionic acid [(2R)-1-benzyl-3-(dimethylamino)-2-methyl-1-phenyl-propyl] ester;hydrochloride
Type:
Small organic molecule
Emp. Form.:
C22H29NO2
Mol. Mass.:
339.4712
SMILES:
CCC(=O)OC(Cc1ccccc1)([C@H](C)CN(C)C)c1ccccc1
: