Target
Endoribonuclease toxin MazF
Ligand
BDBM32018
Substrate
Meas. Tech.
Dose response confirmation uHTS hits for MazEF TA System activators via a fluorescence-based single-stranded RNase assay
EC50
>99000±n/a nM
Citation
 PubChem, PC Dose response confirmation uHTS hits for MazEF TA System activators via a fluorescence-based single-stranded RNase assay PubChem Bioassay (2011)[AID] 
Target
Name:
Endoribonuclease toxin MazF
Synonyms:
MAZF_ECOLI chpAK mazF
Type:
Enzyme Catalytic Domain
Mol. Mass.:
12100.43
Organism:
Escherichia coli str. K-12 substr. MG1655
Description:
gi_16130689
Residue:
111
  
Inhibitor
Name:
BDBM32018
Synonyms:
1,8-DIACETOXY-3-CARBOXYANTHRAQUINONE 4,5-diacetyloxy-9,10-bis(oxidanylidene)anthracene-2-carboxylic acid 4,5-diacetyloxy-9,10-dioxoanthracene-2-carboxylic acid SMR000058958 diacetylrhein
Type:
Small organic molecule
Emp. Form.:
C19H12O8
Mol. Mass.:
368.2938
SMILES:
CC(=O)Oc1cccc2C(=O)c3cc(cc(OC(C)=O)c3C(=O)c12)C(O)=O
: