Target
Endoribonuclease toxin MazF
Ligand
BDBM41489
Substrate
Meas. Tech.
Dose response confirmation uHTS hits for MazEF TA System activators via a fluorescence-based single-stranded RNase assay counterscreen
EC50
55900±n/a nM
Citation
 PubChem, PC Dose response confirmation uHTS hits for MazEF TA System activators via a fluorescence-based single-stranded RNase assay counterscreen PubChem Bioassay (2011)[AID] 
Target
Name:
Endoribonuclease toxin MazF
Synonyms:
MAZF_ECOLI chpAK mazF
Type:
Enzyme Catalytic Domain
Mol. Mass.:
12100.43
Organism:
Escherichia coli str. K-12 substr. MG1655
Description:
gi_16130689
Residue:
111
  
Inhibitor
Name:
BDBM41489
Synonyms:
(4Z)-2-(4-fluorophenyl)-4-[(2-methyl-1H-indol-3-yl)methylene]-2-oxazolin-5-one (4Z)-2-(4-fluorophenyl)-4-[(2-methyl-1H-indol-3-yl)methylidene]-5-oxazolone MLS000531355 cid_5646019
Type:
Small organic molecule
Emp. Form.:
C19H13FN2O2
Mol. Mass.:
320.3171
SMILES:
Cc1[nH]c2ccccc2c1\C=C1/N=C(OC1=O)c1ccc(F)cc1
: