Target
Endoribonuclease toxin MazF
Ligand
BDBM52262
Substrate
Meas. Tech.
Dose response confirmation uHTS hits for MazEF TA System activators via a fluorescence-based single-stranded RNase assay counterscreen
EC50
>99000±n/a nM
Citation
 PubChem, PC Dose response confirmation uHTS hits for MazEF TA System activators via a fluorescence-based single-stranded RNase assay counterscreen PubChem Bioassay (2011)[AID] 
Target
Name:
Endoribonuclease toxin MazF
Synonyms:
MAZF_ECOLI chpAK mazF
Type:
Enzyme Catalytic Domain
Mol. Mass.:
12100.43
Organism:
Escherichia coli str. K-12 substr. MG1655
Description:
gi_16130689
Residue:
111
  
Inhibitor
Name:
BDBM52262
Synonyms:
4-[(4-hydroxyanilino)methyl]-1(2H)-phthalazinone 4-[[(4-hydroxyphenyl)amino]methyl]-2H-phthalazin-1-one SMR000126518 | cid_1482943
Type:
Small organic molecule
Emp. Form.:
C15H13N3O2
Mol. Mass.:
267.2826
SMILES:
Oc1ccc(NCc2n[nH]c(=O)c3ccccc23)cc1
: