Target
Endoribonuclease toxin MazF
Ligand
BDBM83596
Substrate
Meas. Tech.
Dose response confirmation uHTS hits for MazEF TA System activators via a fluorescence-based single-stranded RNase assay counterscreen
EC50
9490±n/a nM
Citation
 PubChem, PC Dose response confirmation uHTS hits for MazEF TA System activators via a fluorescence-based single-stranded RNase assay counterscreen PubChem Bioassay (2011)[AID] 
Target
Name:
Endoribonuclease toxin MazF
Synonyms:
MAZF_ECOLI chpAK mazF
Type:
Enzyme Catalytic Domain
Mol. Mass.:
12100.43
Organism:
Escherichia coli str. K-12 substr. MG1655
Description:
gi_16130689
Residue:
111
  
Inhibitor
Name:
BDBM83596
Synonyms:
(5Z)-1-cyclohexyl-5-[(E)-3-phenylazanylprop-2-enylidene]-1,3-diazinane-2,4,6-trione (5Z)-5-[(E)-3-anilinoprop-2-enylidene]-1-cyclohexyl-barbituric acid MLS000589654 cid_5554345
Type:
Small organic molecule
Emp. Form.:
C19H21N3O3
Mol. Mass.:
339.3883
SMILES:
O=C1NC(=O)C(=CCC=Nc2ccccc2)C(=O)N1C1CCCCC1
: