Target
Endoribonuclease toxin MazF
Ligand
BDBM83666
Substrate
Meas. Tech.
Dose response confirmation uHTS hits for MazEF TA System activators via a fluorescence-based single-stranded RNase assay counterscreen
EC50
4100±n/a nM
Citation
 PubChem, PC Dose response confirmation uHTS hits for MazEF TA System activators via a fluorescence-based single-stranded RNase assay counterscreen PubChem Bioassay (2011)[AID] 
Target
Name:
Endoribonuclease toxin MazF
Synonyms:
MAZF_ECOLI chpAK mazF
Type:
Enzyme Catalytic Domain
Mol. Mass.:
12100.43
Organism:
Escherichia coli str. K-12 substr. MG1655
Description:
gi_16130689
Residue:
111
  
Inhibitor
Name:
BDBM83666
Synonyms:
4-methylbenzoic acid [5-amino-1-(4-fluorophenyl)sulfonyl-3-pyrazolyl] ester MLS000936137 [5-amino-1-(4-fluorophenyl)sulfonylpyrazol-3-yl] 4-methylbenzoate cid_4152828
Type:
Small organic molecule
Emp. Form.:
C17H14FN3O4S
Mol. Mass.:
375.374
SMILES:
Cc1ccc(cc1)C(=O)Oc1cc(N)n(n1)S(=O)(=O)c1ccc(F)cc1
: